[Opendnssec-user] softhsm 3.5 make check assertion failure on ppc64

Rickard Bellgrim rickard at opendnssec.org
Mon Dec 9 11:21:21 UTC 2013

Hi Paul

On Sun, Nov 3, 2013 at 7:48 PM, Paul Wouters <paul at nohats.ca> wrote:

> It seems running "make check" on ppc64 shows a failure:
> make[2]: Entering directory `/builddir/build/BUILD/softhsm-1.3.5/checks'
> ./checks -z
> checks: checks.c:545: runUserCheck: Assertion `rv == (0xa0)' failed.
> Checking C_Initialize and C_Finalize: OK
> Checking C_GetInfo, C_GetFunctionList, C_GetSlotList, C_GetSlotInfo,
> C_GetTokenInfo, C_GetMechanismList, C_GetMechanismInfo: OK
> Checking C_OpenSession, C_CloseSession, C_CloseAllSessions, and
> C_GetSessionInfo: OK
> Checking C_Login and C_Logout: make[2]: Leaving directory
> `/builddir/build/BUILD/softhsm-1.3.5/checks'
> make[2]: *** [check-local] Aborted
> make[1]: *** [check-am] Error 2
> make[1]: Leaving directory `/builddir/build/BUILD/softhsm-1.3.5/checks'
> make: *** [check-recursive] Error 1
> error: Bad exit status from /var/tmp/rpm-tmp.ijR6ce (%check)
> RPM build errors:
>     Bad exit status from /var/tmp/rpm-tmp.ijR6ce (%check)
> Child return code was: 1

SoftHSM will output more information in syslog if you configure/compile it
in debug mode (--with-loglevel=4). Could you perhaps do that and see if you
get any information why it is failing on ppc64?

// Rickard
-------------- next part --------------
An HTML attachment was scrubbed...
URL: <http://lists.opendnssec.org/pipermail/opendnssec-user/attachments/20131209/adedc65d/attachment.htm>

More information about the Opendnssec-user mailing list