[Opendnssec-commits] build-opendnssec-trunk » freebsd64-ods06 - Build # 430 - Failure!

jenkins at opendnssec.org jenkins at opendnssec.org
Fri Feb 15 09:18:43 CET 2013


build-opendnssec-trunk » freebsd64-ods06 - Build # 430 - Failure:

Check console output at https://jenkins.opendnssec.org/job/build-opendnssec-trunk/./label=freebsd64-ods06/430/ to view the results.

FAILED UNIT TESTS:
No tests ran.

BUILD LOG:
[...truncated 533 lines...]
gmake[2]: Leaving directory `/usr/home/jenkins/workspace/build-opendnssec-trunk/label/freebsd64-ods06/build/enforcer/utils'
Making all in test
gmake[2]: Entering directory `/usr/home/jenkins/workspace/build-opendnssec-trunk/label/freebsd64-ods06/build/enforcer/test'
Making all in cunit
gmake[3]: Entering directory `/usr/home/jenkins/workspace/build-opendnssec-trunk/label/freebsd64-ods06/build/enforcer/test/cunit'
gmake[3]: Nothing to be done for `all'.
gmake[3]: Leaving directory `/usr/home/jenkins/workspace/build-opendnssec-trunk/label/freebsd64-ods06/build/enforcer/test/cunit'
gmake[3]: Entering directory `/usr/home/jenkins/workspace/build-opendnssec-trunk/label/freebsd64-ods06/build/enforcer/test'
gmake[3]: Nothing to be done for `all-am'.
gmake[3]: Leaving directory `/usr/home/jenkins/workspace/build-opendnssec-trunk/label/freebsd64-ods06/build/enforcer/test'
gmake[2]: Leaving directory `/usr/home/jenkins/workspace/build-opendnssec-trunk/label/freebsd64-ods06/build/enforcer/test'
gmake[2]: Entering directory `/usr/home/jenkins/workspace/build-opendnssec-trunk/label/freebsd64-ods06/build/enforcer'
gmake[2]: Nothing to be done for `all-am'.
gmake[2]: Leaving directory `/usr/home/jenkins/workspace/build-opendnssec-trunk/label/freebsd64-ods06/build/enforcer'
gmake[1]: Leaving directory `/usr/home/jenkins/workspace/build-opendnssec-trunk/label/freebsd64-ods06/build/enforcer'
Making all in conf
gmake[1]: Entering directory `/usr/home/jenkins/workspace/build-opendnssec-trunk/label/freebsd64-ods06/build/conf'
gmake[1]: Nothing to be done for `all'.
gmake[1]: Leaving directory `/usr/home/jenkins/workspace/build-opendnssec-trunk/label/freebsd64-ods06/build/conf'
Making all in tools
gmake[1]: Entering directory `/usr/home/jenkins/workspace/build-opendnssec-trunk/label/freebsd64-ods06/build/tools'
Making all in solaris
gmake[2]: Entering directory `/usr/home/jenkins/workspace/build-opendnssec-trunk/label/freebsd64-ods06/build/tools/solaris'
gmake[2]: Nothing to be done for `all'.
gmake[2]: Leaving directory `/usr/home/jenkins/workspace/build-opendnssec-trunk/label/freebsd64-ods06/build/tools/solaris'
gmake[2]: Entering directory `/usr/home/jenkins/workspace/build-opendnssec-trunk/label/freebsd64-ods06/build/tools'
gmake[2]: Nothing to be done for `all-am'.
gmake[2]: Leaving directory `/usr/home/jenkins/workspace/build-opendnssec-trunk/label/freebsd64-ods06/build/tools'
gmake[1]: Leaving directory `/usr/home/jenkins/workspace/build-opendnssec-trunk/label/freebsd64-ods06/build/tools'
Making all in signer
gmake[1]: Entering directory `/usr/home/jenkins/workspace/build-opendnssec-trunk/label/freebsd64-ods06/build/signer'
Making all in src
gmake[2]: Entering directory `/usr/home/jenkins/workspace/build-opendnssec-trunk/label/freebsd64-ods06/build/signer/src'
/usr/bin/cc -DHAVE_CONFIG_H -I. -I../../../signer/src -I../../common  -I../../../common -I../../common -I../../../libhsm/src/lib -I/usr/local/include -I/usr/local/include/libxml2 -I/usr/local/include -I/home/jenkins/workspace/root/trunk/include -I/home/jenkins/workspace/root/trunk/include  -I/home/jenkins/workspace/root/trunk/include -std=c99 -pedantic -Wall -Wextra -D_THREAD_SAFE -pthread -MT addns.o -MD -MP -MF .deps/addns.Tpo -c -o addns.o `test -f 'adapter/addns.c' || echo '../../../signer/src/'`adapter/addns.c
mv -f .deps/addns.Tpo .deps/addns.Po
/usr/bin/cc -DHAVE_CONFIG_H -I. -I../../../signer/src -I../../common  -I../../../common -I../../common -I../../../libhsm/src/lib -I/usr/local/include -I/usr/local/include/libxml2 -I/usr/local/include -I/home/jenkins/workspace/root/trunk/include -I/home/jenkins/workspace/root/trunk/include  -I/home/jenkins/workspace/root/trunk/include -std=c99 -pedantic -Wall -Wextra -D_THREAD_SAFE -pthread -MT adfile.o -MD -MP -MF .deps/adfile.Tpo -c -o adfile.o `test -f 'adapter/adfile.c' || echo '../../../signer/src/'`adapter/adfile.c
../../../signer/src/adapter/adfile.c: In function 'adfile_write':
../../../signer/src/adapter/adfile.c:351: error: 'retrun' undeclared (first use in this function)
../../../signer/src/adapter/adfile.c:351: error: (Each undeclared identifier is reported only once
../../../signer/src/adapter/adfile.c:351: error: for each function it appears in.)
../../../signer/src/adapter/adfile.c:351: error: expected ';' before 'ODS_STATUS_MALLOC_ERR'
gmake[2]: *** [adfile.o] Error 1
gmake[2]: Leaving directory `/usr/home/jenkins/workspace/build-opendnssec-trunk/label/freebsd64-ods06/build/signer/src'
gmake[1]: *** [all-recursive] Error 1
gmake[1]: Leaving directory `/usr/home/jenkins/workspace/build-opendnssec-trunk/label/freebsd64-ods06/build/signer'
gmake: *** [all-recursive] Error 1
Build step 'Execute shell' marked build as failure
Email was triggered for: Failure
Sending email for trigger: Failure



More information about the Opendnssec-commits mailing list