[Opendnssec-commits] build-opendnssec-enforcer-ng » ubuntu64-ods02 - Build # 181 - Still Failing!

jenkins at opendnssec.org jenkins at opendnssec.org
Tue Apr 2 16:53:15 CEST 2013


build-opendnssec-enforcer-ng » ubuntu64-ods02 - Build # 181 - Still Failing:

Check console output at https://jenkins.opendnssec.org/job/build-opendnssec-enforcer-ng/./label=ubuntu64-ods02/181/ to view the results.

FAILED UNIT TESTS:
No tests ran.

BUILD LOG:
[...truncated 455 lines...]
make[2]: Entering directory `/home/jenkins/workspace/build-opendnssec-enforcer-ng/label/ubuntu64-ods02/build/tools/solaris'
make[2]: Nothing to be done for `all'.
make[2]: Leaving directory `/home/jenkins/workspace/build-opendnssec-enforcer-ng/label/ubuntu64-ods02/build/tools/solaris'
make[2]: Entering directory `/home/jenkins/workspace/build-opendnssec-enforcer-ng/label/ubuntu64-ods02/build/tools'
make[2]: Nothing to be done for `all-am'.
make[2]: Leaving directory `/home/jenkins/workspace/build-opendnssec-enforcer-ng/label/ubuntu64-ods02/build/tools'
make[1]: Leaving directory `/home/jenkins/workspace/build-opendnssec-enforcer-ng/label/ubuntu64-ods02/build/tools'
Making all in signer
make[1]: Entering directory `/home/jenkins/workspace/build-opendnssec-enforcer-ng/label/ubuntu64-ods02/build/signer'
Making all in src
make[2]: Entering directory `/home/jenkins/workspace/build-opendnssec-enforcer-ng/label/ubuntu64-ods02/build/signer/src'
make[2]: Nothing to be done for `all'.
make[2]: Leaving directory `/home/jenkins/workspace/build-opendnssec-enforcer-ng/label/ubuntu64-ods02/build/signer/src'
Making all in man
make[2]: Entering directory `/home/jenkins/workspace/build-opendnssec-enforcer-ng/label/ubuntu64-ods02/build/signer/man'
make[2]: Nothing to be done for `all'.
make[2]: Leaving directory `/home/jenkins/workspace/build-opendnssec-enforcer-ng/label/ubuntu64-ods02/build/signer/man'
make[2]: Entering directory `/home/jenkins/workspace/build-opendnssec-enforcer-ng/label/ubuntu64-ods02/build/signer'
make[2]: Nothing to be done for `all-am'.
make[2]: Leaving directory `/home/jenkins/workspace/build-opendnssec-enforcer-ng/label/ubuntu64-ods02/build/signer'
make[1]: Leaving directory `/home/jenkins/workspace/build-opendnssec-enforcer-ng/label/ubuntu64-ods02/build/signer'
Making all in enforcer-ng
make[1]: Entering directory `/home/jenkins/workspace/build-opendnssec-enforcer-ng/label/ubuntu64-ods02/build/enforcer-ng'
Making all in src
make[2]: Entering directory `/home/jenkins/workspace/build-opendnssec-enforcer-ng/label/ubuntu64-ods02/build/enforcer-ng/src'
/usr/bin/make  all-recursive
make[3]: Entering directory `/home/jenkins/workspace/build-opendnssec-enforcer-ng/label/ubuntu64-ods02/build/enforcer-ng/src'
Making all in protobuf-orm/test
make[4]: Entering directory `/home/jenkins/workspace/build-opendnssec-enforcer-ng/label/ubuntu64-ods02/build/enforcer-ng/src/protobuf-orm/test'
make[4]: Nothing to be done for `all'.
make[4]: Leaving directory `/home/jenkins/workspace/build-opendnssec-enforcer-ng/label/ubuntu64-ods02/build/enforcer-ng/src/protobuf-orm/test'
make[4]: Entering directory `/home/jenkins/workspace/build-opendnssec-enforcer-ng/label/ubuntu64-ods02/build/enforcer-ng/src'
/usr/lib64/ccache/cc -DHAVE_CONFIG_H -I. -I../../../enforcer-ng/src -I../../common  -I../../../common -I../../common -I../../../enforcer-ng/src/../../libhsm/src/lib -I./../../libhsm/src/lib -I../../../enforcer-ng/src/xmlext-pb -I../../../enforcer-ng/src/protobuf-orm -I/usr/include/libxml2 -I/home/jenkins/workspace/root/enforcer-ng/include -I/usr/local/include -I/usr/include -I/usr/local/include -I/home/jenkins/workspace/root/enforcer-ng/include -pthread  -I/home/jenkins/workspace/root/enforcer-ng/include -pedantic -Wall -Wextra -pthread -MT ods-enforcer.o -MD -MP -MF .deps/ods-enforcer.Tpo -c -o ods-enforcer.o ../../../enforcer-ng/src/ods-enforcer.c
mv -f .deps/ods-enforcer.Tpo .deps/ods-enforcer.Po
/bin/bash ../../libtool --tag=CC   --mode=link /usr/lib64/ccache/cc  -I/home/jenkins/workspace/root/enforcer-ng/include -pedantic -Wall -Wextra -pthread  -L/home/jenkins/workspace/root/enforcer-ng/lib -o ods-enforcer ods-enforcer.o allocator.o duration.o file.o log.o util.o str.o ../../libhsm/src/lib/libhsm.a -L/home/jenkins/workspace/root/enforcer-ng/lib   -L/home/jenkins/workspace/root/enforcer-ng/lib   -lcrypto -lldns -lxml2 @READLINE_LIBS@ -lcrypto  
libtool: link: /usr/lib64/ccache/cc -I/home/jenkins/workspace/root/enforcer-ng/include -pedantic -Wall -Wextra -pthread -o ods-enforcer ods-enforcer.o allocator.o duration.o file.o log.o util.o str.o @READLINE_LIBS@  -L/home/jenkins/workspace/root/enforcer-ng/lib ../../libhsm/src/lib/libhsm.a /home/jenkins/workspace/root/enforcer-ng/lib/libldns.so /usr/lib/libxml2.so -lcrypto -pthread -Wl,-rpath -Wl,/home/jenkins/workspace/root/enforcer-ng/lib -Wl,-rpath -Wl,/home/jenkins/workspace/root/enforcer-ng/lib
cc: @READLINE_LIBS@: No such file or directory
make[4]: *** [ods-enforcer] Error 1
make[4]: Leaving directory `/home/jenkins/workspace/build-opendnssec-enforcer-ng/label/ubuntu64-ods02/build/enforcer-ng/src'
make[3]: *** [all-recursive] Error 1
make[3]: Leaving directory `/home/jenkins/workspace/build-opendnssec-enforcer-ng/label/ubuntu64-ods02/build/enforcer-ng/src'
make[2]: *** [all] Error 2
make[2]: Leaving directory `/home/jenkins/workspace/build-opendnssec-enforcer-ng/label/ubuntu64-ods02/build/enforcer-ng/src'
make[1]: *** [all-recursive] Error 1
make[1]: Leaving directory `/home/jenkins/workspace/build-opendnssec-enforcer-ng/label/ubuntu64-ods02/build/enforcer-ng'
make: *** [all-recursive] Error 1
Build step 'Execute shell' marked build as failure
Email was triggered for: Failure
Sending email for trigger: Failure



More information about the Opendnssec-commits mailing list